Target
Bile acid receptor
Ligand
BDBM50300199
Substrate
Meas. Tech.
ChEMBL_592750 (CHEMBL1043241)
EC50
>100000±n/a nM
Citation
 Pellicciari, RGioiello, AMacchiarulo, AThomas, CRosatelli, ENatalini, BSardella, RPruzanski, MRoda, APastorini, ESchoonjans, KAuwerx, J Discovery of 6alpha-ethyl-23(S)-methylcholic acid (S-EMCA, INT-777) as a potent and selective agonist for the TGR5 receptor, a novel target for diabesity. J Med Chem 52:7958-61 (2009)  
Target
Name:
Bile acid receptor
Synonyms:
BAR FXR HRR1 NR1H4_HUMAN RIP14 Retinoid X receptor-interacting protein 14 | farnesoid x receptor
Type:
Nuclear Receptor
Mol. Mass.:
55916.24
Organism:
Homo sapiens (Human)
Description:
Q96RI1
Residue:
486
  
Inhibitor
Name:
BDBM50300199
Synonyms:
6alpha-ethyl-23(S)-methyl-cholic acid | CHEMBL567640
Type:
Small organic molecule
Emp. Form.:
C27H46O5
Mol. Mass.:
450.6511
SMILES:
CC[C@H]1[C@@H](O)[C@H]2[C@@H]3CC[C@H]([C@H](C)C[C@H](C)C(O)=O)[C@@]3(C)[C@@H](O)C[C@@H]2[C@@]2(C)CC[C@@H](O)C[C@@H]12
: