Target
Disintegrin and metalloproteinase domain-containing protein 10
Ligand
BDBM50301110
Substrate
Meas. Tech.
ChEMBL_598554 (CHEMBL1043546)
IC50
60±n/a nM
Citation
 Li, YLShi, EBurns, DLi, YCovington, MBPan, MScherle, PFriedman, SMetcalf, BYao, W Discovery of novel selective HER-2 sheddase inhibitors through optimization of P1 moiety. Bioorg Med Chem Lett 19:5037-42 (2009)  
Target
Name:
Disintegrin and metalloproteinase domain-containing protein 10
Synonyms:
ADA10_HUMAN Disintegrin and metalloproteinase domain-containing protein 10 (ADAM10) MADM
Type:
Enzyme
Mol. Mass.:
84160.93
Organism:
Homo sapiens (Human)
Description:
O14672
Residue:
748
  
Inhibitor
Name:
BDBM50301110
Synonyms:
(5S,6S)-5-(hydroxycarbamoyl)-6-(3-phenyl-2,5-dihydro-1H-pyrrole-1-carbonyl)piperidin-3-yl pyrrolidine-1-carboxylate | CHEMBL568346
Type:
Small organic molecule
Emp. Form.:
C22H28N4O5
Mol. Mass.:
428.4815
SMILES:
ONC(=O)[C@H]1C[C@@H](CN[C@@H]1C(=O)N1CC=C(C1)c1ccccc1)OC(=O)N1CCCC1
: