Target
Disintegrin and metalloproteinase domain-containing protein 10
Ligand
BDBM50378414
Substrate
Meas. Tech.
ChEMBL_598554 (CHEMBL1043546)
IC50
83±n/a nM
Citation
 Li, YLShi, EBurns, DLi, YCovington, MBPan, MScherle, PFriedman, SMetcalf, BYao, W Discovery of novel selective HER-2 sheddase inhibitors through optimization of P1 moiety. Bioorg Med Chem Lett 19:5037-42 (2009)  
Target
Name:
Disintegrin and metalloproteinase domain-containing protein 10
Synonyms:
ADA10_HUMAN Disintegrin and metalloproteinase domain-containing protein 10 (ADAM10) MADM
Type:
Enzyme
Mol. Mass.:
84160.93
Organism:
Homo sapiens (Human)
Description:
O14672
Residue:
748
  
Inhibitor
Name:
BDBM50378414
Synonyms:
CHEMBL1204013
Type:
Small organic molecule
Emp. Form.:
C22H30N4O5
Mol. Mass.:
430.4974
SMILES:
ONC(=O)[C@H]1CC(CN[C@@H]1C(=O)N1CC[C@@H](C1)c1ccccc1)OC(=O)N1CCCC1
: