Target
Disintegrin and metalloproteinase domain-containing protein 10
Ligand
BDBM50301116
Substrate
Meas. Tech.
ChEMBL_598554 (CHEMBL1043546)
IC50
30±n/a nM
Citation
 Li, YLShi, EBurns, DLi, YCovington, MBPan, MScherle, PFriedman, SMetcalf, BYao, W Discovery of novel selective HER-2 sheddase inhibitors through optimization of P1 moiety. Bioorg Med Chem Lett 19:5037-42 (2009)  
Target
Name:
Disintegrin and metalloproteinase domain-containing protein 10
Synonyms:
ADA10_HUMAN Disintegrin and metalloproteinase domain-containing protein 10 (ADAM10) MADM
Type:
Enzyme
Mol. Mass.:
84160.93
Organism:
Homo sapiens (Human)
Description:
O14672
Residue:
748
  
Inhibitor
Name:
BDBM50301116
Synonyms:
(3S,5S,6S)-5-(hydroxycarbamoyl)-1-methyl-6-(4-phenylpiperazine-1-carbonyl)piperidin-3-yl 2,5-dihydro-1H-pyrrole-1-carboxylate | CHEMBL572091
Type:
Small organic molecule
Emp. Form.:
C23H31N5O5
Mol. Mass.:
457.5227
SMILES:
CN1C[C@H](C[C@@H]([C@H]1C(=O)N1CCN(CC1)c1ccccc1)C(=O)NO)OC(=O)N1CC=CC1
: