Target
Receptor tyrosine-protein kinase erbB-2
Ligand
BDBM50301109
Substrate
Meas. Tech.
ChEMBL_598553 (CHEMBL1043545)
IC50
3.8±n/a nM
Citation
 Li, YLShi, EBurns, DLi, YCovington, MBPan, MScherle, PFriedman, SMetcalf, BYao, W Discovery of novel selective HER-2 sheddase inhibitors through optimization of P1 moiety. Bioorg Med Chem Lett 19:5037-42 (2009)  
Target
Name:
Receptor tyrosine-protein kinase erbB-2
Synonyms:
2.7.10.1 CD_antigen=CD340 ERBB2_HUMAN FASN/HER2 HER2 MLN19 NEU Proto-oncogene Neu Tyrosine kinase-type cell surface receptor HER2 | p185erbB2
Type:
Mol. Mass.:
137894.47
Organism:
Homo sapiens (Human)
Description:
P04626
Residue:
1255
  
Inhibitor
Name:
BDBM50301109
Synonyms:
(5S,6S)-5-(hydroxycarbamoyl)-6-(4-phenylpiperazine-1-carbonyl)piperidin-3-yl pyrrolidine-1-carboxylate | CHEMBL566233
Type:
Small organic molecule
Emp. Form.:
C22H31N5O5
Mol. Mass.:
445.512
SMILES:
ONC(=O)[C@H]1C[C@@H](CN[C@@H]1C(=O)N1CCN(CC1)c1ccccc1)OC(=O)N1CCCC1
: