Target
Cholinesterase
Ligand
BDBM50252790
Substrate
Meas. Tech.
ChEMBL_595209 (CHEMBL1040051)
IC50
3700±n/a nM
Citation
 Carolan, CGDillon, GPKhan, DRyder, SAGaynor, JMReidy, SMarquez, JFJones, MHolland, VGilmer, JF Isosorbide-2-benzyl carbamate-5-salicylate, a peripheral anionic site binding subnanomolar selective butyrylcholinesterase inhibitor. J Med Chem 53:1190-9 (2010)  
Target
Name:
Cholinesterase
Synonyms:
Acylcholine acylhydrolase Butyrylcholine esterase (BChE) Butyrylcholinesterase (BuChE) CHLE_HUMAN Cholinesterases Pseudocholinesterase
Type:
Homotetramer
Mol. Mass.:
68422.27
Organism:
Homo sapiens (Human)
Description:
P06276
Residue:
602
  
Inhibitor
Name:
BDBM50252790
Synonyms:
CHEMBL524046 isosorbide-2-benzyl carbamate
Type:
Small organic molecule
Emp. Form.:
C14H17NO5
Mol. Mass.:
279.2885
SMILES:
O[C@@H]1CO[C@@H]2[C@H](CO[C@H]12)OC(=O)NCc1ccccc1
: