Target
Cholinesterase
Ligand
BDBM50303953
Substrate
Meas. Tech.
ChEMBL_595209 (CHEMBL1040051)
IC50
2609±n/a nM
Citation
 Carolan, CGDillon, GPKhan, DRyder, SAGaynor, JMReidy, SMarquez, JFJones, MHolland, VGilmer, JF Isosorbide-2-benzyl carbamate-5-salicylate, a peripheral anionic site binding subnanomolar selective butyrylcholinesterase inhibitor. J Med Chem 53:1190-9 (2010)  
Target
Name:
Cholinesterase
Synonyms:
Acylcholine acylhydrolase Butyrylcholine esterase (BChE) Butyrylcholinesterase (BuChE) CHLE_HUMAN Cholinesterases Pseudocholinesterase
Type:
Homotetramer
Mol. Mass.:
68422.27
Organism:
Homo sapiens (Human)
Description:
P06276
Residue:
602
  
Inhibitor
Name:
BDBM50303953
Synonyms:
2-(Diethylaminocarbonyloxy-)5-O-salicyloyl-1,4:3,6-dianhydro-D-glucitol | CHEMBL570549
Type:
Small organic molecule
Emp. Form.:
C18H23NO7
Mol. Mass.:
365.3777
SMILES:
CCN(CC)C(=O)O[C@H]1CO[C@@H]2[C@@H](CO[C@H]12)OC(=O)c1ccccc1O
: