Target
Acetylcholinesterase
Ligand
BDBM50004000
Substrate
Meas. Tech.
ChEMBL_595212 (CHEMBL1040054)
IC50
53±n/a nM
Citation
 Carolan, CGDillon, GPKhan, DRyder, SAGaynor, JMReidy, SMarquez, JFJones, MHolland, VGilmer, JF Isosorbide-2-benzyl carbamate-5-salicylate, a peripheral anionic site binding subnanomolar selective butyrylcholinesterase inhibitor. J Med Chem 53:1190-9 (2010)  
Target
Name:
Acetylcholinesterase
Synonyms:
ACES_ELEEL Acetylcholinesterase (EeAChE) | ache
Type:
Enzyme
Mol. Mass.:
71812.79
Organism:
Electrophorus electricus (Electric eel)
Description:
Residue:
633
  
Inhibitor
Name:
BDBM50004000
Synonyms:
(3aS,8aR)-1,3a,8-trimethyl-1,2,3,3a,8,8a-hexahydropyrrolo[2,3-b]indol-5-yl methylcarbamate CHEMBL94 Physostol | physostigmine
Type:
Small organic molecule
Emp. Form.:
C15H21N3O2
Mol. Mass.:
275.3461
SMILES:
CNC(=O)Oc1ccc2N(C)[C@H]3N(C)CC[C@@]3(C)c2c1
: