Target
P2Y purinoceptor 4
Ligand
BDBM50118213
Substrate
Meas. Tech.
ChEMBL_611634 (CHEMBL1068973)
EC50
500±n/a nM
Citation
 Ginsburg-Shmuel, THaas, MSchumann, MReiser, GKalid, OStern, NFischer, B 5-OMe-UDP is a potent and selective P2Y(6)-receptor agonist. J Med Chem 53:1673-85 (2010)  
Target
Name:
P2Y purinoceptor 4
Synonyms:
NRU P2RY4 P2Y purinoceptor 4 Pyrimidinergic receptor P2Y4 Uridine nucleotide receptor
Type:
PROTEIN
Mol. Mass.:
40977.17
Organism:
Homo sapiens (Human)
Description:
ChEMBL_751027
Residue:
365
  
Inhibitor
Name:
BDBM50118213
Synonyms:
5'-UTP H4utp uridine 5'-(tetrahydrogen triphosphate) | uridine 5'-triphosphoric acid
Type:
Small organic molecule
Emp. Form.:
C9H15N2O15P3
Mol. Mass.:
484.1411
SMILES:
O[C@@H]1[C@@H](COP(O)(=O)OP(O)(=O)OP(O)(O)=O)O[C@H]([C@@H]1O)n1ccc(=O)[nH]c1=O
: