Target
Aromatase
Ligand
BDBM50307884
Substrate
Meas. Tech.
ChEMBL_612867 (CHEMBL1067556)
IC50
0.5±n/a nM
Citation
 Woo, LWJackson, TPutey, ACozier, GLeonard, PAcharya, KRChander, SKPurohit, AReed, MJPotter, BV Highly potent first examples of dual aromatase-steroid sulfatase inhibitors based on a biphenyl template. J Med Chem 53:2155-70 (2010)  
Target
Name:
Aromatase
Synonyms:
ARO1 CP19A_HUMAN CYP19 CYPXIX Cytochrome P450 19A1 Cytochrome P450-C19 (CYP19) FL cytokine receptor precursor | P-450AROM
Type:
Enzyme
Mol. Mass.:
57888.92
Organism:
Homo sapiens (Human)
Description:
P11511
Residue:
503
  
Inhibitor
Name:
BDBM50307884
Synonyms:
3-CHLORO-2'-CYANO-5'-(1H-1,2,4-TRIAZOL-1-YLMETHYL)BIPHENYL-4-YL SULFAMATE CHEMBL592131
Type:
Small organic molecule
Emp. Form.:
C16H12ClN5O3S
Mol. Mass.:
389.816
SMILES:
NS(=O)(=O)Oc1ccc(cc1Cl)-c1cc(Cn2cncn2)ccc1C#N
: