Target
5-hydroxytryptamine receptor 1A
Ligand
BDBM50309822
Substrate
Meas. Tech.
ChEMBL_611183 (CHEMBL1065705)
Ki
12±n/a nM
Citation
 Liu, ZZhang, HYe, NZhang, JWu, QSun, PLi, LZhen, XZhang, A Synthesis of dihydrofuroaporphine derivatives: identification of a potent and selective serotonin 5-HT 1A receptor agonist. J Med Chem 53:1319-28 (2010)  
Target
Name:
5-hydroxytryptamine receptor 1A
Synonyms:
5-HT-1A 5-hydroxytryptamine receptor 1A (5-HT-1A) ADRB2RL1 Dopamine D2 receptor and serotonin 1a receptor HTR1A | Serotonin receptor 1A
Type:
Mol. Mass.:
46122.49
Organism:
Homo sapiens (Human)
Description:
Residue:
422
  
Inhibitor
Name:
BDBM50309822
Synonyms:
CHEMBL598037 | N-Methyl-2-hydroxy-2'-methyl-2',3'-dihydrofuro[m]aporphine
Type:
Small organic molecule
Emp. Form.:
C20H21NO2
Mol. Mass.:
307.3862
SMILES:
CC1Cc2ccc3C[C@H]4N(C)CCc5cc(O)cc(c45)-c3c2O1
: