Target
Transient receptor potential cation channel subfamily V member 1
Ligand
BDBM50315618
Substrate
Meas. Tech.
ChEMBL_627601 (CHEMBL1113607)
IC50
29±n/a nM
Citation
 Blum, CACaldwell, TZheng, XBakthavatchalam, RCapitosti, SBrielmann, HDe Lombaert, SKershaw, MTMatson, DKrause, JECortright, DCrandall, MMartin, WJMurphy, BABoyce, SJones, ABMason, GRycroft, WPerrett, HConley, RBurnaby-Davies, NChenard, BLHodgetts, KJ Discovery of novel 6,6-heterocycles as transient receptor potential vanilloid (TRPV1) antagonists. J Med Chem 53:3330-48 (2010)  
Target
Name:
Transient receptor potential cation channel subfamily V member 1
Synonyms:
Capsaicin receptor Osm-9-like TRP channel 1 TRPV1_HUMAN Transient receptor potential cation channel subfamily V member 1 (TRPV1) Transient receptor potential cation channel subfamily V member 1(TRPV1) Vanilloid VR1 Vanilloid receptor 1 Vanilloid receptor 1 (VRI/TRPV1)
Type:
Protein
Mol. Mass.:
94960.75
Organism:
Homo sapiens (Human)
Description:
Q8NER1
Residue:
839
  
Inhibitor
Name:
BDBM50315618
Synonyms:
(5-Trifluoromethylpyridin-2-yl)-[7-(3-trifluoromethylpyridin-2-yl)cinnolin-4-yl]amine | CHEMBL1092544
Type:
Small organic molecule
Emp. Form.:
C21H12F6N4
Mol. Mass.:
434.3372
SMILES:
FC(F)(F)c1ccc(Nc2cnnc3cc(ccc23)-c2ncccc2C(F)(F)F)cc1
: