Target
Ectonucleotide pyrophosphatase/phosphodiesterase family member 2
Ligand
BDBM50366944
Substrate
Meas. Tech.
ChEMBL_623314 (CHEMBL1115237)
Ki
824±n/a nM
Citation
 North, EJHoward, ALWanjala, IWPham, TCBaker, DLParrill, AL Pharmacophore development and application toward the identification of novel, small-molecule autotaxin inhibitors. J Med Chem 53:3095-105 (2010)  
Target
Name:
Ectonucleotide pyrophosphatase/phosphodiesterase family member 2
Synonyms:
ATX Autotaxin (ATX) ENPP2 Ectonucleotide Pyrophosphatase/Phosphodiesterase 2 (ENPP2) Extracellular lysophospholipase D PDNP2
Type:
Enzyme
Mol. Mass.:
99007.13
Organism:
Homo sapiens (Human)
Description:
Q13822
Residue:
863
  
Inhibitor
Name:
BDBM50366944
Synonyms:
Azovan Blue EVANS BLUE
Type:
Small organic molecule
Emp. Form.:
C34H24N6O14S4
Mol. Mass.:
868.848
SMILES:
Cc1cc(ccc1N=Nc1ccc2c(cc(c(N)c2c1O)S([O-])(=O)=O)S([O-])(=O)=O)-c1ccc(N=Nc2ccc3c(cc(c(N)c3c2O)S([O-])(=O)=O)S([O-])(=O)=O)c(C)c1
: