Target
Melatonin receptor type 1A
Ligand
BDBM50125757
Substrate
Meas. Tech.
ChEMBL_632475 (CHEMBL1108339)
EC50
73±n/a nM
Citation
 Mésangeau, CPérès, BDescamps-François, CChavatte, PAudinot, VCoumailleau, SBoutin, JADelagrange, PBennejean, CRenard, PCaignard, DHBerthelot, PYous, S Design, synthesis and pharmacological evaluation of novel naphthalenic derivatives as selective MT(1) melatoninergic ligands. Bioorg Med Chem 18:3426-36 (2010)  
Target
Name:
Melatonin receptor type 1A
Synonyms:
MTNR1A MTR1A_HUMAN Mel1a melatonin receptor Melatonin receptor Melatonin receptor type 1 (MT1) | Melatonin receptor type 1A
Type:
Enzyme
Mol. Mass.:
39392.94
Organism:
Homo sapiens (Human)
Description:
P48039
Residue:
350
  
Inhibitor
Name:
BDBM50125757
Synonyms:
CHEMBL14453 N-[2-(7-{4-[8-(2-Acetylamino-ethyl)-naphthalen-2-yloxy]-butoxy}-naphthalen-1-yl)-ethyl]-acetamide
Type:
Small organic molecule
Emp. Form.:
C32H36N2O4
Mol. Mass.:
512.6392
SMILES:
CC(=O)NCCc1cccc2ccc(OCCCCOc3ccc4cccc(CCNC(C)=O)c4c3)cc12
: