Target
Aromatase
Ligand
BDBM50028962
Substrate
Meas. Tech.
ChEMBL_630232 (CHEMBL1105634)
IC50
8±n/a nM
Citation
 Muftuoglu, YMustata, G Pharmacophore modeling strategies for the development of novel nonsteroidal inhibitors of human aromatase (CYP19). Bioorg Med Chem Lett 20:3050-64 (2010)  
Target
Name:
Aromatase
Synonyms:
ARO1 CP19A_HUMAN CYP19 CYPXIX Cytochrome P450 19A1 Cytochrome P450-C19 (CYP19) FL cytokine receptor precursor | P-450AROM
Type:
Enzyme
Mol. Mass.:
57888.92
Organism:
Homo sapiens (Human)
Description:
P11511
Residue:
503
  
Inhibitor
Name:
BDBM50028962
Synonyms:
CHEMBL275638 | flavone
Type:
Small organic molecule
Emp. Form.:
C15H10O2
Mol. Mass.:
222.2387
SMILES:
O=c1cc(oc2ccccc12)-c1ccccc1
: