Target
Type-2 angiotensin II receptor
Ligand
BDBM50321065
Substrate
Meas. Tech.
ChEMBL_637186 (CHEMBL1167160)
Ki
13.8±n/a nM
Citation
 Mahalingam, AKWan, YMurugaiah, AMWallinder, CWu, XPlouffe, BBotros, MNyberg, FHallberg, AGallo-Payet, NAlterman, M Selective angiotensin II AT(2) receptor agonists with reduced CYP 450 inhibition. Bioorg Med Chem 18:4570-90 (2010)  
Target
Name:
Type-2 angiotensin II receptor
Synonyms:
Angiotensin type II receptor
Type:
PROTEIN
Mol. Mass.:
15474.49
Organism:
Sus scrofa
Description:
ChEMBL_1285617
Residue:
137
  
Inhibitor
Name:
BDBM50321065
Synonyms:
CHEMBL1165260 | N-Butyloxycarbonyl-3-[4-(oxazole-2-carbonyl)-phenyl]-5-iso-butylthiophene-2-sulfonamide
Type:
Small organic molecule
Emp. Form.:
C23H26N2O6S2
Mol. Mass.:
490.592
SMILES:
CCCCOC(=O)NS(=O)(=O)c1sc(CC(C)C)cc1-c1ccc(cc1)C(=O)c1ncco1
: