Target
Type-2 angiotensin II receptor
Ligand
BDBM50321077
Substrate
Meas. Tech.
ChEMBL_637186 (CHEMBL1167160)
Ki
68.6±n/a nM
Citation
 Mahalingam, AKWan, YMurugaiah, AMWallinder, CWu, XPlouffe, BBotros, MNyberg, FHallberg, AGallo-Payet, NAlterman, M Selective angiotensin II AT(2) receptor agonists with reduced CYP 450 inhibition. Bioorg Med Chem 18:4570-90 (2010)  
Target
Name:
Type-2 angiotensin II receptor
Synonyms:
Angiotensin type II receptor
Type:
PROTEIN
Mol. Mass.:
15474.49
Organism:
Sus scrofa
Description:
ChEMBL_1285617
Residue:
137
  
Inhibitor
Name:
BDBM50321077
Synonyms:
CHEMBL1165496 | N-Butyloxycarbonyl-3-[4-(3-methyl-2,5-dioxoimidazolidin-1-yl-methyl)-phenyl]-5-iso-butyl-thiophene-2-sulfonamide
Type:
Small organic molecule
Emp. Form.:
C24H31N3O6S2
Mol. Mass.:
521.649
SMILES:
CCCCOC(=O)NS(=O)(=O)c1sc(CC(C)C)cc1-c1ccc(Cn2c(O)cn(C)c2=O)cc1
: