Target
Delta-type opioid receptor
Ligand
BDBM50321606
Substrate
Meas. Tech.
ChEMBL_639786 (CHEMBL1175731)
IC50
0.398107±n/a nM
Citation
 Lee, YSFernandes, SKulkarani, VMayorov, ADavis, PMa, SWBrown, KGillies, RJLai, JPorreca, FHruby, VJ Design and synthesis of trivalent ligands targeting opioid, cholecystokinin, and melanocortin receptors for the treatment of pain. Bioorg Med Chem Lett 20:4080-4 (2010)  
Target
Name:
Delta-type opioid receptor
Synonyms:
D-OR-1 Delta opioid receptor OPIATE Delta OPRD1 OPRK1 | opioid receptor, delta 1
Type:
G Protein-Coupled Receptor (GPCR)
Mol. Mass.:
40382.98
Organism:
Homo sapiens (Human)
Description:
Competition binding assays were carried out using membrane preparations from transfected HN9.10 cells that constitutively expressed the delta opioid receptor.
Residue:
372
  
Inhibitor
Name:
BDBM50321606
Synonyms:
(3S,6S,9S,12S,15R,18S,21S,27R,30S)-18-((1H-imidazol-5-yl)methyl)-9-((1H-indol-3-yl)methyl)-30-amino-3-((S)-1-amino-1-oxo-3-phenylpropan-2-ylcarbamoyl)-21-benzyl-6-butyl-12-(3-guanidinopropyl)-31-(4-hydroxy-2,6-dimethylphenyl)-27-methyl-15-(naphthalen-2-ylmethyl)-5,8,11,14,17,20,23,26,29-nonaoxo-4,7,10,13,16,19,22,25,28-nonaazahentriacontan-1-oic acid | CHEMBL1172253
Type:
Small organic molecule
Emp. Form.:
C80H98N18O14
Mol. Mass.:
1535.7463
SMILES:
CCCC[C@H](NC(=O)[C@H](Cc1c[nH]c2ccccc12)NC(=O)[C@H](CCCN=C(N)N)NC(=O)[C@@H](Cc1ccc2ccccc2c1)NC(=O)[C@H](Cc1cnc[nH]1)NC(=O)[C@H](Cc1ccccc1)NC(=O)CNC(=O)[C@@H](C)NC(=O)[C@@H](N)Cc1c(C)cc(O)cc1C)C(=O)N[C@@H](CC(O)=O)C(=O)N[C@@H](Cc1ccccc1)C(N)=O
: