Target
Cholecystokinin receptor type A
Ligand
BDBM50321604
Substrate
Meas. Tech.
ChEMBL_639788 (CHEMBL1175733)
Ki
1.6±n/a nM
Citation
 Lee, YSFernandes, SKulkarani, VMayorov, ADavis, PMa, SWBrown, KGillies, RJLai, JPorreca, FHruby, VJ Design and synthesis of trivalent ligands targeting opioid, cholecystokinin, and melanocortin receptors for the treatment of pain. Bioorg Med Chem Lett 20:4080-4 (2010)  
Target
Name:
Cholecystokinin receptor type A
Synonyms:
CCK-A receptor CCK1-R CCKAR_HUMAN Cholecystokinin receptor Cholecystokinin-1 Receptor
Type:
G Protein-Coupled Receptor (GPCR)
Mol. Mass.:
47859.34
Organism:
Homo sapiens (Human)
Description:
Stable expression of human CCK-1 receptors in HEK 293 cells.
Residue:
428
  
Inhibitor
Name:
BDBM50321604
Synonyms:
(3S,6S,9S,12S,15R,18S,21S,24R,27S)-18-((1H-imidazol-5-yl)methyl)-9-((1H-indol-3-yl)methyl)-27-amino-3-((S)-1-amino-1-oxo-3-phenylpropan-2-ylcarbamoyl)-21-benzyl-6-butyl-12-(3-guanidinopropyl)-28-(4-hydroxyphenyl)-24-methyl-15-(naphthalen-2-ylmethyl)-5,8,11,14,17,20,23,26-octaoxo-4,7,10,13,16,19,22,25-octaazaoctacosan-1-oic acid | CHEMBL1172429
Type:
Small organic molecule
Emp. Form.:
C76H91N17O13
Mol. Mass.:
1450.6418
SMILES:
CCCC[C@H](NC(=O)[C@H](Cc1c[nH]c2ccccc12)NC(=O)[C@H](CCCN=C(N)N)NC(=O)[C@@H](Cc1ccc2ccccc2c1)NC(=O)[C@H](Cc1cnc[nH]1)NC(=O)[C@H](Cc1ccccc1)NC(=O)[C@@H](C)NC(=O)[C@@H](N)Cc1ccc(O)cc1)C(=O)N[C@@H](CC(O)=O)C(=O)N[C@@H](Cc1ccccc1)C(N)=O
: