Target
Serine/threonine-protein kinase Chk1
Ligand
BDBM50321679
Substrate
Meas. Tech.
ChEMBL_639904 (CHEMBL1173978)
IC50
15000±n/a nM
Citation
 Matthews, TPMcHardy, TKlair, SBoxall, KFisher, MCherry, MAllen, CEAddison, GJEllard, JAherne, GWWestwood, IMvan Montfort, RGarrett, MDReader, JCCollins, I Design and evaluation of 3,6-di(hetero)aryl imidazo[1,2-a]pyrazines as inhibitors of checkpoint and other kinases. Bioorg Med Chem Lett 20:4045-9 (2010)  
Target
Name:
Serine/threonine-protein kinase Chk1
Synonyms:
CHEK1 CHK1 checkpoint homolog Checkpoint kinase-1 (CHK1)
Type:
Enzyme Catalytic Domain
Mol. Mass.:
54443.02
Organism:
Homo sapiens (Human)
Description:
gi_166295192
Residue:
476
  
Inhibitor
Name:
BDBM50321679
Synonyms:
4-(3-(1H-pyrazol-4-yl)imidazo[1,2-a]pyrazin-6-yl)aniline | CHEMBL1172286
Type:
Small organic molecule
Emp. Form.:
C15H12N6
Mol. Mass.:
276.296
SMILES:
Nc1ccc(cc1)-c1cn2c(cnc2cn1)-c1cn[nH]c1
: