Target
Serine/threonine-protein kinase Chk1
Ligand
BDBM50321662
Substrate
Meas. Tech.
ChEMBL_639904 (CHEMBL1173978)
IC50
>100000±n/a nM
Citation
 Matthews, TPMcHardy, TKlair, SBoxall, KFisher, MCherry, MAllen, CEAddison, GJEllard, JAherne, GWWestwood, IMvan Montfort, RGarrett, MDReader, JCCollins, I Design and evaluation of 3,6-di(hetero)aryl imidazo[1,2-a]pyrazines as inhibitors of checkpoint and other kinases. Bioorg Med Chem Lett 20:4045-9 (2010)  
Target
Name:
Serine/threonine-protein kinase Chk1
Synonyms:
CHEK1 CHK1 checkpoint homolog Checkpoint kinase-1 (CHK1)
Type:
Enzyme Catalytic Domain
Mol. Mass.:
54443.02
Organism:
Homo sapiens (Human)
Description:
gi_166295192
Residue:
476
  
Inhibitor
Name:
BDBM50321662
Synonyms:
6-(1H-indol-3-yl)-3-phenylimidazo[1,2-a]pyrazine | CHEMBL1170534
Type:
Small organic molecule
Emp. Form.:
C20H14N4
Mol. Mass.:
310.352
SMILES:
c1nc2cnc(cn2c1-c1ccccc1)-c1c[nH]c2ccccc12
: