Target
Serine/threonine-protein kinase Chk1
Ligand
BDBM50321663
Substrate
Meas. Tech.
ChEMBL_639904 (CHEMBL1173978)
IC50
>100000±n/a nM
Citation
 Matthews, TPMcHardy, TKlair, SBoxall, KFisher, MCherry, MAllen, CEAddison, GJEllard, JAherne, GWWestwood, IMvan Montfort, RGarrett, MDReader, JCCollins, I Design and evaluation of 3,6-di(hetero)aryl imidazo[1,2-a]pyrazines as inhibitors of checkpoint and other kinases. Bioorg Med Chem Lett 20:4045-9 (2010)  
Target
Name:
Serine/threonine-protein kinase Chk1
Synonyms:
CHEK1 CHK1 checkpoint homolog Checkpoint kinase-1 (CHK1)
Type:
Enzyme Catalytic Domain
Mol. Mass.:
54443.02
Organism:
Homo sapiens (Human)
Description:
gi_166295192
Residue:
476
  
Inhibitor
Name:
BDBM50321663
Synonyms:
3-phenyl-6-(pyridin-2-yl)imidazo[1,2-a]pyrazine | CHEMBL1170741
Type:
Small organic molecule
Emp. Form.:
C17H12N4
Mol. Mass.:
272.304
SMILES:
c1nc2cnc(cn2c1-c1ccccc1)-c1ccccn1
: