Target
Serine/threonine-protein kinase Chk2
Ligand
BDBM50321655
Substrate
Meas. Tech.
ChEMBL_639915 (CHEMBL1173989)
IC50
1300±n/a nM
Citation
 Matthews, TPMcHardy, TKlair, SBoxall, KFisher, MCherry, MAllen, CEAddison, GJEllard, JAherne, GWWestwood, IMvan Montfort, RGarrett, MDReader, JCCollins, I Design and evaluation of 3,6-di(hetero)aryl imidazo[1,2-a]pyrazines as inhibitors of checkpoint and other kinases. Bioorg Med Chem Lett 20:4045-9 (2010)  
Target
Name:
Serine/threonine-protein kinase Chk2
Synonyms:
CDS1 CHK2 Checkpoint Kinase (Chk2) Serine/threonine-protein kinase Chek2 | Serine/threonine-protein kinase Chk1/2
Type:
Protein
Mol. Mass.:
60908.59
Organism:
Homo sapiens (Human)
Description:
O96017
Residue:
543
  
Inhibitor
Name:
BDBM50321655
Synonyms:
3-(1H-indol-3-yl)-6-(1H-pyrazol-4-yl)imidazo[1,2-a]pyrazine | CHEMBL1170126
Type:
Small organic molecule
Emp. Form.:
C17H12N6
Mol. Mass.:
300.3174
SMILES:
c1n[nH]cc1-c1cn2c(cnc2cn1)-c1c[nH]c2ccccc12
: