Target
Serine/threonine-protein kinase Chk2
Ligand
BDBM50321651
Substrate
Meas. Tech.
ChEMBL_639915 (CHEMBL1173989)
IC50
2200±n/a nM
Citation
 Matthews, TPMcHardy, TKlair, SBoxall, KFisher, MCherry, MAllen, CEAddison, GJEllard, JAherne, GWWestwood, IMvan Montfort, RGarrett, MDReader, JCCollins, I Design and evaluation of 3,6-di(hetero)aryl imidazo[1,2-a]pyrazines as inhibitors of checkpoint and other kinases. Bioorg Med Chem Lett 20:4045-9 (2010)  
Target
Name:
Serine/threonine-protein kinase Chk2
Synonyms:
CDS1 CHK2 Checkpoint Kinase (Chk2) Serine/threonine-protein kinase Chek2 | Serine/threonine-protein kinase Chk1/2
Type:
Protein
Mol. Mass.:
60908.59
Organism:
Homo sapiens (Human)
Description:
O96017
Residue:
543
  
Inhibitor
Name:
BDBM50321651
Synonyms:
(4-(3-(1H-pyrazol-4-yl)imidazo[1,2-a]pyrazin-6-yl)phenyl)methanol | CHEMBL1170749
Type:
Small organic molecule
Emp. Form.:
C16H13N5O
Mol. Mass.:
291.3073
SMILES:
OCc1ccc(cc1)-c1cn2c(cnc2cn1)-c1cn[nH]c1
: