Target
Tyrosine-protein kinase ABL1
Ligand
BDBM50321649
Substrate
Meas. Tech.
ChEMBL_639910 (CHEMBL1173984)
IC50
440±n/a nM
Citation
 Matthews, TPMcHardy, TKlair, SBoxall, KFisher, MCherry, MAllen, CEAddison, GJEllard, JAherne, GWWestwood, IMvan Montfort, RGarrett, MDReader, JCCollins, I Design and evaluation of 3,6-di(hetero)aryl imidazo[1,2-a]pyrazines as inhibitors of checkpoint and other kinases. Bioorg Med Chem Lett 20:4045-9 (2010)  
Target
Name:
Tyrosine-protein kinase ABL1
Synonyms:
ABL ABL1_HUMAN JTK7 Proto-oncogene tyrosine-protein kinase ABL1 Tyrosine-protein kinase ABL V-abl Abelson murine leukemia viral oncogene homolog 1 p150 | tyrosine-protein kinase ABL1 isoform a
Type:
Enzyme
Mol. Mass.:
122897.30
Organism:
Homo sapiens (Human)
Description:
P00519
Residue:
1130
  
Inhibitor
Name:
BDBM50321649
Synonyms:
3,6-di(1H-pyrazol-4-yl)imidazo[1,2-a]pyrimidine | CHEMBL1171532
Type:
Small organic molecule
Emp. Form.:
C12H9N7
Mol. Mass.:
251.2468
SMILES:
c1n[nH]cc1-c1cnc2ncc(cn12)-c1cn[nH]c1
: