Target
Histamine H3 receptor
Ligand
BDBM50321819
Substrate
Meas. Tech.
ChEMBL_643311 (CHEMBL1177482)
Ki
>1000±n/a nM
Citation
 Ishikawa, MFuruuchi, TYamauchi, MYokoyama, FKakui, NSato, Y Synthesis and structure-activity relationships of N-aryl-piperidine derivatives as potent (partial) agonists for human histamine H3 receptor. Bioorg Med Chem 18:5441-8 (2010)  
Target
Name:
Histamine H3 receptor
Synonyms:
G-protein coupled receptor 97 HH3R HRH3 Histamine H3 receptor (H3) Histamine receptor (H3 and H4)
Type:
G Protein-Coupled Receptor (GPCR)
Mol. Mass.:
48691.47
Organism:
Homo sapiens (Human)
Description:
Binding assays were using CHO cells stably expressing hH3R receptors.
Residue:
445
  
Inhibitor
Name:
BDBM50321819
Synonyms:
1-((1H-Imidazol-4-yl)methyl)-4-(4-tert-butylphenyl)-piperazine | CHEMBL1173808
Type:
Small organic molecule
Emp. Form.:
C18H26N4
Mol. Mass.:
298.4258
SMILES:
CC(C)(C)c1ccc(cc1)N1CCN(Cc2cnc[nH]2)CC1
: