Target
Histamine H3 receptor
Ligand
BDBM50321823
Substrate
Meas. Tech.
ChEMBL_643311 (CHEMBL1177482)
Ki
1±n/a nM
Citation
 Ishikawa, MFuruuchi, TYamauchi, MYokoyama, FKakui, NSato, Y Synthesis and structure-activity relationships of N-aryl-piperidine derivatives as potent (partial) agonists for human histamine H3 receptor. Bioorg Med Chem 18:5441-8 (2010)  
Target
Name:
Histamine H3 receptor
Synonyms:
G-protein coupled receptor 97 HH3R HRH3 Histamine H3 receptor (H3) Histamine receptor (H3 and H4)
Type:
G Protein-Coupled Receptor (GPCR)
Mol. Mass.:
48691.47
Organism:
Homo sapiens (Human)
Description:
Binding assays were using CHO cells stably expressing hH3R receptors.
Residue:
445
  
Inhibitor
Name:
BDBM50321823
Synonyms:
4-((1H-Imidazol-4-yl)methyl)-1-(3-(trifluoromethyl)-phenyl)piperidine | CHEMBL1172579
Type:
Small organic molecule
Emp. Form.:
C16H18F3N3
Mol. Mass.:
309.3294
SMILES:
FC(F)(F)c1cccc(c1)N1CCC(Cc2cnc[nH]2)CC1
: