Target
Histamine H3 receptor
Ligand
BDBM50321828
Substrate
Meas. Tech.
ChEMBL_643311 (CHEMBL1177482)
Ki
16±n/a nM
Citation
 Ishikawa, MFuruuchi, TYamauchi, MYokoyama, FKakui, NSato, Y Synthesis and structure-activity relationships of N-aryl-piperidine derivatives as potent (partial) agonists for human histamine H3 receptor. Bioorg Med Chem 18:5441-8 (2010)  
Target
Name:
Histamine H3 receptor
Synonyms:
G-protein coupled receptor 97 HH3R HRH3 Histamine H3 receptor (H3) Histamine receptor (H3 and H4)
Type:
G Protein-Coupled Receptor (GPCR)
Mol. Mass.:
48691.47
Organism:
Homo sapiens (Human)
Description:
Binding assays were using CHO cells stably expressing hH3R receptors.
Residue:
445
  
Inhibitor
Name:
BDBM50321828
Synonyms:
4-((1H-Imidazol-4-yl)methyl)-1-(naphthalen-2-yl)piperidine | CHEMBL1173390
Type:
Small organic molecule
Emp. Form.:
C19H21N3
Mol. Mass.:
291.3901
SMILES:
C(C1CCN(CC1)c1ccc2ccccc2c1)c1cnc[nH]1
: