Target
Histamine H2 receptor
Ligand
BDBM50321816
Substrate
Meas. Tech.
ChEMBL_643317 (CHEMBL1177488)
Ki
>1000±n/a nM
Citation
 Ishikawa, MFuruuchi, TYamauchi, MYokoyama, FKakui, NSato, Y Synthesis and structure-activity relationships of N-aryl-piperidine derivatives as potent (partial) agonists for human histamine H3 receptor. Bioorg Med Chem 18:5441-8 (2010)  
Target
Name:
Histamine H2 receptor
Synonyms:
Gastric receptor I HISTAMINE H2 HRH2_HUMAN Histamine H2-Gs alpha S
Type:
G Protein-Coupled Receptor (GPCR)
Mol. Mass.:
40115.31
Organism:
Homo sapiens (Human)
Description:
Residue:
359
  
Inhibitor
Name:
BDBM50321816
Synonyms:
4-((1H-Imidazol-4-yl)methyl)-1-(4-methoxyphenyl)piperidine | CHEMBL1172775
Type:
Small organic molecule
Emp. Form.:
C16H21N3O
Mol. Mass.:
271.3574
SMILES:
COc1ccc(cc1)N1CCC(Cc2cnc[nH]2)CC1
: