Target
Histamine H4 receptor
Ligand
BDBM50321816
Substrate
Meas. Tech.
ChEMBL_643318 (CHEMBL1177489)
Ki
3100±n/a nM
Citation
 Ishikawa, MFuruuchi, TYamauchi, MYokoyama, FKakui, NSato, Y Synthesis and structure-activity relationships of N-aryl-piperidine derivatives as potent (partial) agonists for human histamine H3 receptor. Bioorg Med Chem 18:5441-8 (2010)  
Target
Name:
Histamine H4 receptor
Synonyms:
AXOR35 GPCR105 HH4R HRH4 Histamine H4 receptor Histamine receptor (H3 and H4) SP9144
Type:
G Protein-Coupled Receptor (GPCR)
Mol. Mass.:
44517.02
Organism:
Homo sapiens (Human)
Description:
Binding assays were using CHO cells stably expressing hH4R receptors.
Residue:
390
  
Inhibitor
Name:
BDBM50321816
Synonyms:
4-((1H-Imidazol-4-yl)methyl)-1-(4-methoxyphenyl)piperidine | CHEMBL1172775
Type:
Small organic molecule
Emp. Form.:
C16H21N3O
Mol. Mass.:
271.3574
SMILES:
COc1ccc(cc1)N1CCC(Cc2cnc[nH]2)CC1
: