Target
Zinc finger protein GLI1
Ligand
BDBM50321858
Substrate
Meas. Tech.
ChEMBL_641630 (CHEMBL1176449)
IC50
2600±n/a nM
Citation
 Mahindroo, NConnelly, MCPunchihewa, CYang, LYan, BFujii, N Amide conjugates of ketoprofen and indole as inhibitors of Gli1-mediated transcription in the Hedgehog pathway. Bioorg Med Chem 18:4801-11 (2011)  
Target
Name:
Zinc finger protein GLI1
Synonyms:
GLI GLI1_HUMAN
Type:
PROTEIN
Mol. Mass.:
117920.33
Organism:
Homo sapiens (Human)
Description:
ChEMBL_537531
Residue:
1106
  
Inhibitor
Name:
BDBM50321858
Synonyms:
2-(3-Benzoylphenyl)-N-(1H-indol-6-yl)-N-propylpropanamide | CHEMBL1173148
Type:
Small organic molecule
Emp. Form.:
C27H26N2O2
Mol. Mass.:
410.5075
SMILES:
CCCN(C(=O)C(C)c1cccc(c1)C(=O)c1ccccc1)c1ccc2cc[nH]c2c1
: