Target
Peroxisome proliferator-activated receptor gamma
Ligand
BDBM50322686
Substrate
Meas. Tech.
ChEMBL_642076 (CHEMBL1176108)
EC50
740±n/a nM
Citation
 Seto, SOkada, KKiyota, KIsogai, SIwago, MShinozaki, TKitamura, YKohno, YMurakami, K Design, synthesis, and structure-activity relationship studies of novel 2,4,6-trisubstituted-5-pyrimidinecarboxylic acids as peroxisome proliferator-activated receptor gamma (PPARgamma) partial agonists with comparable antidiabetic efficacy to rosiglitazone. J Med Chem 53:5012-24 (2010)  
Target
Name:
Peroxisome proliferator-activated receptor gamma
Synonyms:
NR1C3 PPAR-gamma PPARG_HUMAN Peroxisome proliferator-activated receptor gamma (PPAR gamma) Peroxisome proliferator-activated receptor gamma (PPARĪ³) peroxisome proliferator-activated receptor gamma isoform 2
Type:
Nuclear Receptor
Mol. Mass.:
57613.46
Organism:
Homo sapiens (Human)
Description:
P37231
Residue:
505
  
Inhibitor
Name:
BDBM50322686
Synonyms:
4-(Benzylthio)-2-(methylthio)-6-(3-pyridylmethylamino)pyrimidine-5-carboxylic Acid | CHEMBL1172961
Type:
Small organic molecule
Emp. Form.:
C19H18N4O2S2
Mol. Mass.:
398.502
SMILES:
CSc1nc(NCc2cccnc2)c(C(O)=O)c(SCc2ccccc2)n1
: