Target
Cysteinyl leukotriene receptor 1
Ligand
BDBM50069364
Substrate
Meas. Tech.
ChEMBL_647615 (CHEMBL1219966)
IC50
0.9±n/a nM
Citation
 Dong, XWang, LHuang, XLiu, TWei, EDu, LYang, BHu, Y Pharmacophore identification, synthesis, and biological evaluation of carboxylated chalcone derivatives as CysLT1 antagonists. Bioorg Med Chem 18:5519-27 (2010)  
Target
Name:
Cysteinyl leukotriene receptor 1
Synonyms:
CLTR1_HUMAN CYSLTR1 Cysteinyl leukotriene receptor HG55 LTD4 receptor | Leukotriene Cysteinyl 1
Type:
Enzyme Catalytic Domain
Mol. Mass.:
38565.16
Organism:
Homo sapiens (Human)
Description:
Leukotriene Cysteinyl 1 CYSLTR1 HUMAN::Q9Y271
Residue:
337
  
Inhibitor
Name:
BDBM50069364
Synonyms:
(1-{(R)-1-{3-[(E)-2-(6-Butyl-5-methyl-pyridin-2-yl)-vinyl]-phenyl}-3-[2-(1-hydroxy-1-methyl-ethyl)-phenyl]-propylsulfanylmethyl}-cyclopropyl)-acetic acid CHEMBL341547
Type:
Small organic molecule
Emp. Form.:
C36H45NO3S
Mol. Mass.:
571.812
SMILES:
CCCCc1nc(\C=C\c2cccc(c2)[C@@H](CCc2ccccc2C(C)(C)O)SCC2(CC(O)=O)CC2)ccc1C
: