Target
Cysteinyl leukotriene receptor 1
Ligand
BDBM50064069
Substrate
Meas. Tech.
ChEMBL_647615 (CHEMBL1219966)
IC50
1100±n/a nM
Citation
 Dong, XWang, LHuang, XLiu, TWei, EDu, LYang, BHu, Y Pharmacophore identification, synthesis, and biological evaluation of carboxylated chalcone derivatives as CysLT1 antagonists. Bioorg Med Chem 18:5519-27 (2010)  
Target
Name:
Cysteinyl leukotriene receptor 1
Synonyms:
CLTR1_HUMAN CYSLTR1 Cysteinyl leukotriene receptor HG55 LTD4 receptor | Leukotriene Cysteinyl 1
Type:
Enzyme Catalytic Domain
Mol. Mass.:
38565.16
Organism:
Homo sapiens (Human)
Description:
Leukotriene Cysteinyl 1 CYSLTR1 HUMAN::Q9Y271
Residue:
337
  
Inhibitor
Name:
BDBM50064069
Synonyms:
4-Oxo-2-[4-(quinazolin-2-ylmethoxy)-phenyl]-4H-chromene-8-carboxylic acid CHEMBL417135
Type:
Small organic molecule
Emp. Form.:
C25H16N2O5
Mol. Mass.:
424.4049
SMILES:
OC(=O)c1cccc2c1oc(cc2=O)-c1ccc(OCc2ncc3ccccc3n2)cc1
: