Target
5-hydroxytryptamine receptor 1A
Ligand
BDBM50330444
Substrate
Meas. Tech.
ChEMBL_684850 (CHEMBL1286080)
IC50
1.3±n/a nM
Citation
 Asagarasu, AMatsui, THayashi, HTamaoki, SYamauchi, YMinato, KSato, M Discovery of a novel 5-HT(3) antagonist/5-HT(1A) agonist 3-amino-5,6,7,8-tetrahydro-2-{4-[4-(quinolin-2-yl)piperazin-1-yl]butyl}quinazolin-4(3H)-one (TZB-30878) as an orally bioavailable agent for irritable bowel syndrome. J Med Chem 53:7549-63 (2010)  
Target
Name:
5-hydroxytryptamine receptor 1A
Synonyms:
5-HT-1A 5-hydroxytryptamine receptor 1A (5-HT-1A) ADRB2RL1 Dopamine D2 receptor and serotonin 1a receptor HTR1A | Serotonin receptor 1A
Type:
Mol. Mass.:
46122.49
Organism:
Homo sapiens (Human)
Description:
Residue:
422
  
Inhibitor
Name:
BDBM50330444
Synonyms:
3-Amino-7-nitro-2-[3-(4-quinolin-2-ylpiperazin-1-yl)propylthio]-3H-quinazolin-4-one | CHEMBL1277371
Type:
Small organic molecule
Emp. Form.:
C24H25N7O3S
Mol. Mass.:
491.565
SMILES:
Nn1c(SCCCN2CCN(CC2)c2ccc3ccccc3n2)nc2cc(ccc2c1=O)[N+]([O-])=O
: