Target
5-hydroxytryptamine receptor 1A
Ligand
BDBM50330449
Substrate
Meas. Tech.
ChEMBL_684850 (CHEMBL1286080)
IC50
6.1±n/a nM
Citation
 Asagarasu, AMatsui, THayashi, HTamaoki, SYamauchi, YMinato, KSato, M Discovery of a novel 5-HT(3) antagonist/5-HT(1A) agonist 3-amino-5,6,7,8-tetrahydro-2-{4-[4-(quinolin-2-yl)piperazin-1-yl]butyl}quinazolin-4(3H)-one (TZB-30878) as an orally bioavailable agent for irritable bowel syndrome. J Med Chem 53:7549-63 (2010)  
Target
Name:
5-hydroxytryptamine receptor 1A
Synonyms:
5-HT-1A 5-hydroxytryptamine receptor 1A (5-HT-1A) ADRB2RL1 Dopamine D2 receptor and serotonin 1a receptor HTR1A | Serotonin receptor 1A
Type:
Mol. Mass.:
46122.49
Organism:
Homo sapiens (Human)
Description:
Residue:
422
  
Inhibitor
Name:
BDBM50330449
Synonyms:
3-Amino-5,6-dimethyl-2-[3-[4-(5,6,7,8-tetrahydroquinolin-2-yl)-piperazin-1-yl]propylthio]-3H-thieno[2,3-d]pyrimidin-4-one | CHEMBL1276919
Type:
Small organic molecule
Emp. Form.:
C24H32N6OS2
Mol. Mass.:
484.68
SMILES:
Cc1sc2nc(SCCCN3CCN(CC3)c3ccc4CCCCc4n3)n(N)c(=O)c2c1C
: