Target
5-hydroxytryptamine receptor 3A
Ligand
BDBM50330458
Substrate
Meas. Tech.
ChEMBL_684849 (CHEMBL1286079)
IC50
26.7±n/a nM
Citation
 Asagarasu, AMatsui, THayashi, HTamaoki, SYamauchi, YMinato, KSato, M Discovery of a novel 5-HT(3) antagonist/5-HT(1A) agonist 3-amino-5,6,7,8-tetrahydro-2-{4-[4-(quinolin-2-yl)piperazin-1-yl]butyl}quinazolin-4(3H)-one (TZB-30878) as an orally bioavailable agent for irritable bowel syndrome. J Med Chem 53:7549-63 (2010)  
Target
Name:
5-hydroxytryptamine receptor 3A
Synonyms:
5-HT-3 5-HT3A 5-hydroxytryptamine receptor 3 (5-HT3) 5-hydroxytryptamine receptor 3A (5HT3A) 5HT3R HTR3A Serotonin 3 receptor (5HT3) Serotonin-gated ion channel receptor | Serotonin-gated ion channel receptor 3
Type:
Protein
Mol. Mass.:
55283.27
Organism:
Homo sapiens (Human)
Description:
P46098
Residue:
478
  
Inhibitor
Name:
BDBM50330458
Synonyms:
3-Amino-5,6-dimethyl-2-[4-(4-quinolin-2-ylpiperazin-1-yl)butyl]-3H-thieno[2,3-d]pyrimidin-4-one | CHEMBL1277559
Type:
Small organic molecule
Emp. Form.:
C25H30N6OS
Mol. Mass.:
462.61
SMILES:
Cc1sc2nc(CCCCN3CCN(CC3)c3ccc4ccccc4n3)n(N)c(=O)c2c1C
: