Target
Carbonic anhydrase 4
Ligand
BDBM26981
Substrate
Meas. Tech.
ChEMBL_700701 (CHEMBL1645740)
Ki
80000±n/a nM
Citation
 Ekinci, DCeyhun, SBSentürk, MErdem, DKüfrevioglu, OISupuran, CT Characterization and anions inhibition studies of ana-carbonic anhydrase from the teleost fish Dicentrarchus labrax. Bioorg Med Chem 19:744-8 (2011)  
Target
Name:
Carbonic anhydrase 4
Synonyms:
CA-IV CAH4_HUMAN Carbonic anhydrase Carbonic anhydrase IV (CA IV)
Type:
Enzyme
Mol. Mass.:
35037.98
Organism:
Homo sapiens (Human)
Description:
P22748
Residue:
312
  
Inhibitor
Name:
BDBM26981
Synonyms:
CHEMBL1644695 POTASSIUM IODIDE iodide ion
Type:
Ion
Emp. Form.:
I
Mol. Mass.:
126.90502
SMILES:
[I-]
: