Target
Delta-type opioid receptor
Ligand
BDBM50334989
Substrate
Meas. Tech.
ChEMBL_702694 (CHEMBL1657768)
EC50
0.090000±n/a nM
Citation
 Cowell, SMHanlon, KE Development of potent µ and d opioid agonists with high lipophilicity. J Med Chem 54:382-6 (2011)  
Target
Name:
Delta-type opioid receptor
Synonyms:
D-OR-1 Delta opioid receptor OPIATE Delta OPRD1 OPRK1 | opioid receptor, delta 1
Type:
G Protein-Coupled Receptor (GPCR)
Mol. Mass.:
40382.98
Organism:
Homo sapiens (Human)
Description:
Competition binding assays were carried out using membrane preparations from transfected HN9.10 cells that constitutively expressed the delta opioid receptor.
Residue:
372
  
Inhibitor
Name:
BDBM50334989
Synonyms:
(R)-2-((S)-2-amino-3-(4-hydroxy-2,6-dimethylphenyl)propanoyl)-N-(2-((S)-3-(4-fluorophenyl)-1-oxo-1-(4-(N-phenylpropionamido)piperidin-1-yl)propan-2-ylamino)-2-oxoethyl)-1,2,3,4-tetrahydroisoquinoline-3-carboxamide | CHEMBL1649947
Type:
Small organic molecule
Emp. Form.:
C46H53FN6O6
Mol. Mass.:
804.948
SMILES:
CCC(=O)N(C1CCN(CC1)C(=O)[C@H](Cc1ccc(F)cc1)NC(=O)CNC(=O)[C@H]1Cc2ccccc2CN1C(=O)[C@@H](N)Cc1c(C)cc(O)cc1C)c1ccccc1
: