Target
Transient receptor potential M8 protein
Ligand
BDBM50335171
Substrate
Meas. Tech.
ChEMBL_701543 (CHEMBL1656182)
IC50
0.8±n/a nM
Citation
 Ballentine, SKColburn, RWDamiano, BPFlores, CMHutchinson, TLIllig, CRLiu, YLubin, MLMa, JMeegalla, SKParks, DJBaker, JFParsons, WHPlayer, MRQin, NSchneider, CRStone, DJ Design and optimization of benzimidazole-containing transient receptor potential melastatin 8 (TRPM8) antagonists. J Med Chem 54:233-47 (2011)  
Target
Name:
Transient receptor potential M8 protein
Synonyms:
Cold-menthol receptor (TRPM8) Transient receptor potential M8 protein Transient receptor potential melastatin subfamily, type 8 (TRPM8)
Type:
Enzyme
Mol. Mass.:
127589.43
Organism:
Canis lupus familiaris (Dog)
Description:
Q1A7N1
Residue:
1104
  
Inhibitor
Name:
BDBM50335171
Synonyms:
3-[5-(2-Fluoro-6-trifluoromethoxyphenyl)-1H-benzimidazol-2-yl]-1-oxa-2-aza-spiro[4.5]dec-2-ene | CHEMBL1650520
Type:
Small organic molecule
Emp. Form.:
C22H19F4N3O2
Mol. Mass.:
433.3988
SMILES:
Fc1cccc(OC(F)(F)F)c1-c1ccc2nc([nH]c2c1)C1=NOC2(C1)CCCCC2
: