Target
Tyrosine-protein kinase JAK2
Ligand
BDBM50335204
Substrate
Meas. Tech.
ChEMBL_701697 (CHEMBL1656589)
IC50
1300±n/a nM
Citation
 Ioannidis, SLamb, MLWang, TAlmeida, LBlock, MHDavies, AMPeng, BSu, MZhang, HJHoffmann, ERivard, CGreen, IHoward, TPollard, HRead, JAlimzhanov, MBebernitz, GBell, KYe, MHuszar, DZinda, M Discovery of 5-chloro-N2-[(1S)-1-(5-fluoropyrimidin-2-yl)ethyl]-N4-(5-methyl-1H-pyrazol-3-yl)pyrimidine-2,4-diamine (AZD1480) as a novel inhibitor of the Jak/Stat pathway. J Med Chem 54:262-76 (2011)  
Target
Name:
Tyrosine-protein kinase JAK2
Synonyms:
JAK-2 JAK2_HUMAN Janus kinase 2 (JAK2) | Janus kinase 2 (a protein tyrosine kinase)
Type:
Protein
Mol. Mass.:
130684.68
Organism:
Homo sapiens (Human)
Description:
O60674
Residue:
1132
  
Inhibitor
Name:
BDBM50335204
Synonyms:
(R)-5-Chloro-2-[1-(5-fluoropyrimidin-2-yl)ethoxy]-N-(5-methyl-1H-pyrazol-3-yl)pyrimidin-4-amine | CHEMBL1650727
Type:
Small organic molecule
Emp. Form.:
C14H13ClFN7O
Mol. Mass.:
349.751
SMILES:
C[C@@H](Oc1ncc(Cl)c(Nc2cc(C)n[nH]2)n1)c1ncc(F)cn1
: