Target
Tyrosine-protein kinase JAK3
Ligand
BDBM50335212
Substrate
Meas. Tech.
ChEMBL_701698 (CHEMBL1656590)
IC50
8350±n/a nM
Citation
 Ioannidis, SLamb, MLWang, TAlmeida, LBlock, MHDavies, AMPeng, BSu, MZhang, HJHoffmann, ERivard, CGreen, IHoward, TPollard, HRead, JAlimzhanov, MBebernitz, GBell, KYe, MHuszar, DZinda, M Discovery of 5-chloro-N2-[(1S)-1-(5-fluoropyrimidin-2-yl)ethyl]-N4-(5-methyl-1H-pyrazol-3-yl)pyrimidine-2,4-diamine (AZD1480) as a novel inhibitor of the Jak/Stat pathway. J Med Chem 54:262-76 (2011)  
Target
Name:
Tyrosine-protein kinase JAK3
Synonyms:
JAK-3 JAK3_HUMAN Janus kinase 3 (JAK3) L-JAK | Leukocyte janus kinase
Type:
Protein
Mol. Mass.:
125111.08
Organism:
Homo sapiens (Human)
Description:
P52333
Residue:
1124
  
Inhibitor
Name:
BDBM50335212
Synonyms:
CHEMBL1650725 | N2-[(1S)-1-(5-fluoropyrimidin-2-yl)ethyl]-5-methyl-N4-(5-methyl-1H-pyrazol-3-yl)pyrimidine-2,4-diamine
Type:
Small organic molecule
Emp. Form.:
C15H17FN8
Mol. Mass.:
328.3475
SMILES:
C[C@H](Nc1ncc(C)c(Nc2cc(C)n[nH]2)n1)c1ncc(F)cn1
: