Target
Outer membrane protein MIP
Ligand
BDBM50335221
Substrate
Meas. Tech.
ChEMBL_701873 (CHEMBL1657165)
IC50
>100000±n/a nM
Citation
 Juli, CSippel, MJäger, JThiele, AWeiwad, MSchweimer, KRösch, PSteinert, MSotriffer, CAHolzgrabe, U Pipecolic acid derivatives as small-molecule inhibitors of the Legionella MIP protein. J Med Chem 54:277-83 (2011)  
Target
Name:
Outer membrane protein MIP
Synonyms:
MIP_LEGPN PPIase Rotamase | mip
Type:
PROTEIN
Mol. Mass.:
24869.94
Organism:
Legionella pneumophila
Description:
ChEMBL_701873
Residue:
233
  
Inhibitor
Name:
BDBM50335221
Synonyms:
CHEMBL1650805 | ethyl 1-(3-nitrophenylsulfonyl)piperidine-2-carboxylate
Type:
Small organic molecule
Emp. Form.:
C14H18N2O6S
Mol. Mass.:
342.368
SMILES:
CCOC(=O)C1CCCCN1S(=O)(=O)c1cccc(c1)[N+]([O-])=O
: