Target
Cathepsin S
Ligand
BDBM50335280
Substrate
Meas. Tech.
ChEMBL_702783 (CHEMBL1655226)
Ki
0.2±n/a nM
Citation
 Frizler, MLohr, FFurtmann, NKläs, JGütschow, M Structural optimization of azadipeptide nitriles strongly increases association rates and allows the development of selective cathepsin inhibitors. J Med Chem 54:396-400 (2011)  
Target
Name:
Cathepsin S
Synonyms:
CATS_HUMAN Cathepsin S (Cat S) | cathepsin S preproprotein
Type:
Protein
Mol. Mass.:
37507.38
Organism:
Homo sapiens (Human)
Description:
P25774
Residue:
331
  
Inhibitor
Name:
BDBM50335280
Synonyms:
CHEMBL1651354 acs.jmedchem.1c00409_ST.408
Type:
Small organic molecule
Emp. Form.:
C17H25N5O2
Mol. Mass.:
331.4127
SMILES:
CC(C)C[C@H](NC(=O)NCc1ccccc1)C(=O)N(C)N(C)C#N
: