Target
Cathepsin K
Ligand
BDBM50335279
Substrate
Meas. Tech.
ChEMBL_702784 (CHEMBL1655227)
Ki
0.16±n/a nM
Citation
 Frizler, MLohr, FFurtmann, NKläs, JGütschow, M Structural optimization of azadipeptide nitriles strongly increases association rates and allows the development of selective cathepsin inhibitors. J Med Chem 54:396-400 (2011)  
Target
Name:
Cathepsin K
Synonyms:
CATK_HUMAN CTSO Cathepsin O Cathepsin X
Type:
Enzyme
Mol. Mass.:
36975.68
Organism:
Homo sapiens (Human)
Description:
P43235
Residue:
329
  
Inhibitor
Name:
BDBM50335279
Synonyms:
CHEMBL1651353 | N-(Benzyloxycarbonyl)-tyrosyl-methylazalanine-nitrile
Type:
Small organic molecule
Emp. Form.:
C20H22N4O4
Mol. Mass.:
382.4131
SMILES:
CN(C#N)N(C)C(=O)[C@H](Cc1ccc(O)cc1)NC(=O)OCc1ccccc1
: