Target
Cathepsin B
Ligand
BDBM50304794
Substrate
Meas. Tech.
ChEMBL_702785 (CHEMBL1655228)
Ki
0.43±n/a nM
Citation
 Frizler, MLohr, FFurtmann, NKläs, JGütschow, M Structural optimization of azadipeptide nitriles strongly increases association rates and allows the development of selective cathepsin inhibitors. J Med Chem 54:396-400 (2011)  
Target
Name:
Cathepsin B
Synonyms:
APP secretase CATB_HUMAN CTSB Cathepsin B light chain | Cathepsin B1
Type:
Enzyme
Mol. Mass.:
37819.69
Organism:
Homo sapiens (Human)
Description:
gi_63102437
Residue:
339
  
Inhibitor
Name:
BDBM50304794
Synonyms:
(S)-benzyl 1-(2-cyano-1,2-dimethylhydrazinyl)-4-methyl-1-oxopentan-2-ylcarbamate acs.jmedchem.1c00409_ST.401
Type:
Small organic molecule
Emp. Form.:
C17H24N4O3
Mol. Mass.:
332.3975
SMILES:
CC(C)C[C@H](NC(=O)OCc1ccccc1)C(=O)N(C)N(C)C#N
: