Target
Fatty-acid amide hydrolase 1 [30-579]
Ligand
BDBM50335377
Substrate
Meas. Tech.
ChEMBL_701749 (CHEMBL1656752)
IC50
7.4±n/a nM
Citation
 Johnson, DSStiff, CLazerwith, SEKesten, SRFay, LKMorris, MBeidler, DLiimatta, MBSmith, SEDudley, DTSadagopan, NBhattachar, SNKesten, SJNomanbhoy, TKCravatt, BFAhn, K Discovery of PF-04457845: A Highly Potent, Orally Bioavailable, and Selective Urea FAAH Inhibitor. ACS Med Chem Lett 2:91-96 (2011)  
Target
Name:
Fatty-acid amide hydrolase 1 [30-579]
Synonyms:
Anandamide amidohydrolase 1 Faah Fatty Acid Amide Hydrolase Fatty-acid amide hydrolase (FAAH) Fatty-acid amide hydrolase 1 (FAAH) Oleamide hydrolase 1
Type:
Single-pass membrane protein; homodimer
Mol. Mass.:
60474.00
Organism:
Rattus norvegicus (rat)
Description:
P97612 (aa 30-579)
Residue:
550
  
Inhibitor
Name:
BDBM50335377
Synonyms:
CHEMBL1651534 | N-Pyridazin-3-yl-4-(3-{[5-(trifluoromethyl)pyridin-2-yl]oxy}benzylidene)piperidine-1-carboxamide
Type:
Small organic molecule
Emp. Form.:
C23H20F3N5O2
Mol. Mass.:
455.4324
SMILES:
FC(F)(F)c1ccc(-[#8]-c2cccc(\[#6]=[#6]-3\[#6]-[#6]-[#7](-[#6]-[#6]-3)-[#6](=O)-[#7]-c3cccnn3)c2)nc1
: