Target
Cytochrome P450 2D6
Ligand
BDBM50335380
Substrate
Meas. Tech.
ChEMBL_701745 (CHEMBL1656748)
IC50
1400±n/a nM
Citation
 Johnson, DSStiff, CLazerwith, SEKesten, SRFay, LKMorris, MBeidler, DLiimatta, MBSmith, SEDudley, DTSadagopan, NBhattachar, SNKesten, SJNomanbhoy, TKCravatt, BFAhn, K Discovery of PF-04457845: A Highly Potent, Orally Bioavailable, and Selective Urea FAAH Inhibitor. ACS Med Chem Lett 2:91-96 (2011)  
Target
Name:
Cytochrome P450 2D6
Synonyms:
CP2D6_HUMAN CYP2DL1 Cytochrome P450 2D6 (CYP2D6) P450-DB1
Type:
Protein
Mol. Mass.:
55774.82
Organism:
Homo sapiens (Human)
Description:
P10635
Residue:
497
  
Inhibitor
Name:
BDBM50335380
Synonyms:
CHEMBL1651525 | N-Pyridin-3-yl-4-(3-{[5-(trifluoromethyl)pyridin-2-yl]oxy}benzylidene)piperidine-1-carboxamide
Type:
Small organic molecule
Emp. Form.:
C24H21F3N4O2
Mol. Mass.:
454.4443
SMILES:
FC(F)(F)c1ccc(-[#8]-c2cccc(\[#6]=[#6]-3\[#6]-[#6]-[#7](-[#6]-[#6]-3)-[#6](=O)-[#7]-c3cccnc3)c2)nc1
: