Target
P2X purinoceptor 2
Ligand
BDBM50268765
Substrate
Meas. Tech.
ChEMBL_718656 (CHEMBL1680807)
IC50
1000±n/a nM
Citation
 Baqi, YHausmann, RRosefort, CRettinger, JSchmalzing, GMüller, CE Discovery of potent competitive antagonists and positive modulators of the P2X2 receptor. J Med Chem 54:817-30 (2012)  
Target
Name:
P2X purinoceptor 2
Synonyms:
ATP receptor P2X purinoceptor 2 P2X2/P2X3 receptor Purinergic receptor | Purinergic, P2X2
Type:
Enzyme Catalytic Domain
Mol. Mass.:
52625.55
Organism:
RAT
Description:
Purinergic, P2X2 0 RAT::P49653
Residue:
472
  
Inhibitor
Name:
BDBM50268765
Synonyms:
CHEMBL498038 | sodium 1-amino-4-(3-amino-5-carboxyphenylamino)-9,10-dioxo-9,10-dihydroanthracene-2-sulfonate
Type:
Small organic molecule
Emp. Form.:
C21H14N3O7S
Mol. Mass.:
452.417
SMILES:
Nc1cc(Nc2cc(c(N)c3C(=O)c4ccccc4C(=O)c23)S([O-])(=O)=O)cc(c1)C(O)=O
: