Target
Histone deacetylase 3
Ligand
BDBM26109
Substrate
Meas. Tech.
ChEMBL_718470 (CHEMBL1680134)
IC50
9000±n/a nM
Citation
 Fass, DMShah, RGhosh, BHennig, KNorton, SZhao, WNReis, SAKlein, PSMazitschek, RMaglathlin, RLLewis, TAHaggarty, SJ Effect of Inhibiting Histone Deacetylase with Short-Chain Carboxylic Acids and Their Hydroxamic Acid Analogs on Vertebrate Development and Neuronal Chromatin. ACS Med Chem Lett 2:39-42 (2011)  
Target
Name:
Histone deacetylase 3
Synonyms:
HD3 HDAC3_HUMAN Human HDAC3 SMAP45
Type:
Enzyme
Mol. Mass.:
48829.55
Organism:
Homo sapiens (Human)
Description:
O15379
Residue:
428
  
Inhibitor
Name:
BDBM26109
Synonyms:
Butyrate butanoic acid, 4
Type:
Small organic molecule
Emp. Form.:
C4H8O2
Mol. Mass.:
88.1051
SMILES:
CCCC(O)=O
: